[PD-cvs] autobuild: pd-extended ubuntu-dapper-i386 2006-12-25 07.35.43

pd at ubuntu-dapper-i386.idmi.poly.edu pd at ubuntu-dapper-i386.idmi.poly.edu
Mon Dec 25 13:52:46 CET 2006


chmod a-x "/home/pd/auto-build/pd-extended/externals/ggee/signal/streamout~.pd_linux"
strip --strip-unneeded -R .note -R .comment /home/pd/auto-build/pd-extended/externals/ggee/signal/streamout~.pd_linux
rm -f -- /home/pd/auto-build/pd-extended/externals/ggee/signal/streamout~.o
cc -DPD -O2 -mcpu=i686 -march=i386 -I/home/pd/auto-build/pd-extended/pd/src -Wall -W -ggdb -DUNIX -Dunix -fPIC -o "/home/pd/auto-build/pd-extended/externals/hcs/classpath.o" -c "/home/pd/auto-build/pd-extended/externals/hcs/classpath.c"
`-mcpu=' is deprecated. Use `-mtune=' or '-march=' instead.
/home/pd/auto-build/pd-extended/externals/hcs/classpath.c: In function ‘classpath_add’:
/home/pd/auto-build/pd-extended/externals/hcs/classpath.c:95: warning: unused parameter ‘x’
/home/pd/auto-build/pd-extended/externals/hcs/classpath.c:95: warning: unused parameter ‘s’
/home/pd/auto-build/pd-extended/externals/hcs/classpath.c: In function ‘classpath_new’:
/home/pd/auto-build/pd-extended/externals/hcs/classpath.c:112: error: ‘PD_BUGFIX_VERSION’ undeclared (first use in this function)
/home/pd/auto-build/pd-extended/externals/hcs/classpath.c:112: error: (Each undeclared identifier is reported only once
/home/pd/auto-build/pd-extended/externals/hcs/classpath.c:112: error: for each function it appears in.)
make[2]: *** [/home/pd/auto-build/pd-extended/externals/hcs/classpath.o] Error 1
make[2]: Leaving directory `/home/pd/auto-build/pd-extended/externals'
make[1]: *** [externals_install] Error 2
make[1]: Leaving directory `/home/pd/auto-build/pd-extended/packages'
make: *** [install] Error 2
upload specs linux_make build tar.bz2
Uploading /home/pd/auto-build/pd-extended/packages/linux_make/build/Pd*.tar.bz2
ls: /home/pd/auto-build/pd-extended/packages/linux_make/build/Pd*.tar.bz2: No such file or directory




More information about the Pd-cvs mailing list