[PD-cvs] autobuild: pd-extended macosx105-i386 2010-01-14 12.41.27

pd at macosx105-i386.idmi.poly.edu pd at macosx105-i386.idmi.poly.edu
Thu Jan 14 19:02:28 CET 2010


last 20 errors ----------------------------------------
rsync error: some files could not be transferred (code 23) at /SourceCache/rsync/rsync-35.2/rsync/main.c(1400) [generator=2.6.9]
ERROR: module is write only
rsync error: syntax or usage error (code 1) at main.c(710) [sender=3.0.3]
rsync error: error in rsync protocol data stream (code 12) at /SourceCache/rsync/rsync-35.2/rsync/io.c(452) [receiver=2.6.9]
last 15 lines ----------------------------------------
/Users/pd/auto-build/pd-extended/externals/mrpeach/net/udpsend~.c:80: warning: 'ps_average' defined but not used
/Users/pd/auto-build/pd-extended/externals/mrpeach/net/udpsend~.c:81: warning: 'ps_sf_mp3' defined but not used
/Users/pd/auto-build/pd-extended/externals/mrpeach/net/udpsend~.c:81: warning: 'ps_sf_aac' defined but not used
/var/tmp//ccgIdV06.s:2015:no such instruction: `fctiw %st,%st'
/var/tmp//ccgIdV06.s:2016:no such instruction: `stfd %st, 200(%esp)'
make[2]: *** [/Users/pd/auto-build/pd-extended/externals/mrpeach/net/udpsend~.o] Error 1
make[1]: *** [externals_install] Error 2
make: *** [extended_install] Error 2
ls: /Users/pd/auto-build/pd-extended/packages/darwin_app/./Pd*.dmg: No such file or directory
upload specs darwin_app . dmg
Uploading 
ERROR: module is write only
rsync error: syntax or usage error (code 1) at main.c(710) [sender=3.0.3]
rsync: connection unexpectedly closed (4 bytes received so far) [receiver]
rsync error: error in rsync protocol data stream (code 12) at /SourceCache/rsync/rsync-35.2/rsync/io.c(452) [receiver=2.6.9]

the full logfile - if it has been succesfully uploaded - can be viewed at:
http://autobuild.puredata.info/auto-build/2010-01-14/logs/2010-01-14_12.41.27_darwin_macosx105-i386_pd-extended.txt




More information about the Pd-cvs mailing list