[PD-cvs] autobuild: pd-extended debian-testing-amd64 2012-09-16 06.28.14

pd buildbot pd at debian-testing-amd64.pdlab.hfbk.net
Sun Sep 16 13:01:28 CEST 2012


last 20 errors ----------------------------------------
recordV4L2.cpp:81:5: error: '::close' has not been declared
recordV4L2.cpp:159:3: error: '::write' has not been declared
recordV4L2.cpp:184:3: error: '::write' has not been declared
rsync error: syntax or usage error (code 1) at main.c(1246) [Receiver=3.0.9]
last 15 lines ----------------------------------------
make[4]: *** [all-recursive] Error 1
make[4]: Leaving directory `/home/pd/auto-build/pd-extended/externals/Gem/plugins'
make[3]: *** [all-recursive] Error 1
make[3]: Leaving directory `/home/pd/auto-build/pd-extended/externals/Gem'
make[2]: *** [/home/pd/auto-build/pd-extended/externals/Gem/Gem.pd_linux] Error 2
make[2]: Leaving directory `/home/pd/auto-build/pd-extended/externals'
make[1]: *** [externals_install] Error 2
make[1]: Leaving directory `/home/pd/auto-build/pd-extended/packages'
make: *** [install] Error 2
ls: cannot access /home/pd/auto-build/pd-extended/packages/linux_make/./Pd*.deb: No such file or directory
upload specs linux_make . deb
Uploading 
Unexpected local arg: README
If arg is a remote file/dir, prefix it with a colon (:).
rsync error: syntax or usage error (code 1) at main.c(1246) [Receiver=3.0.9]

the full logfile - if it has been succesfully uploaded - can be viewed at:
http://autobuild.puredata.info/auto-build/2012-09-16/logs/2012-09-16_06.28.14_linux_debian-testing-amd64_pd-extended.txt



More information about the Pd-cvs mailing list