[PD-cvs] autobuild: pd-extended debian-wheezy-amd64 2012-09-25 23.36.19

pd buildbot pd at debian-testing-amd64.pdlab.hfbk.net
Wed Sep 26 05:42:22 CEST 2012

last 20 errors ----------------------------------------
rsync error: syntax or usage error (code 1) at main.c(1246) [Receiver=3.0.9]
last 15 lines ----------------------------------------
		PD_PATH=/home/pd/auto-build/pd-extended/pd PD_INCLUDE=/home/pd/auto-build/pd-extended/pd/src
make: Entering an unknown directory
make: *** /home/pd/auto-build/pd-extended/externals/arraysize: No such file or directory.  Stop.
make: Leaving an unknown directory
make[2]: *** [arraysize] Error 2
make[2]: Leaving directory `/home/pd/auto-build/pd-extended/externals'
make[1]: *** [externals_install] Error 2
make[1]: Leaving directory `/home/pd/auto-build/pd-extended/packages'
make: *** [install] Error 2
ls: cannot access /home/pd/auto-build/pd-extended/packages/linux_make/./Pd*.deb: No such file or directory
upload specs linux_make . deb
Unexpected local arg: README
If arg is a remote file/dir, prefix it with a colon (:).
rsync error: syntax or usage error (code 1) at main.c(1246) [Receiver=3.0.9]

the full logfile - if it has been succesfully uploaded - can be viewed at:

More information about the Pd-cvs mailing list