[PD] Gem compilation error with avifile

Peter Plessas plessas at mur.at
Sun Oct 15 21:43:27 CEST 2006

Hi List,

I get an compilation error with Gem-cvs and libavifile:


as follows:

/usr/include/avifile-0.7/avm_stl.h:275: error: invalid use of 
constructor as a template
/usr/include/avifile-0.7/avm_stl.h:275: note: use 
'avm::vector<Type>::vector' instead of 'avm::vector<Type>::class 
avm::vector<Type>' to name the constructor in a qualified name
make[1]: *** [filmAVIPLAY.o] Error 1
make[1]: *** Waiting for unfinished jobs....
make[1]: Leaving directory `/usr/local/src/cvs/Gem/src/Pixes'
make: *** [Pixes] Error 2

This is on Debian/ppc testing.

Any hints are well appreciated!

lg, Peter

More information about the Pd-list mailing list