[PD] Problems compiling Gem 0.92-0

IOhannes m zmoelnig zmoelnig at iem.at
Mon Sep 14 09:23:43 CEST 2009

James Dunn wrote:
> I've just been trying to compile gem 0.92-0 for ubuntu jaunty 9.04 and I 
> get the following errors when I run make:
> GemSetup.cpp:50:22: error: s_stuff.h: No such file or directory
> GemSetup.cpp: In function 'void Gem_addownpath(const char*)':
> GemSetup.cpp:96: error: 'sys_searchpath' was not declared in this scope
> GemSetup.cpp:96: error: 'namelist_append' was not declared in this scope
> make[1]: *** [GemSetup.o] Error 1
> make[1]: Leaving directory `/home/james/Desktop/gem-0.92-0/src/Base'
> make: *** [Base] Error 2
> Can anyone help? I don't seem to have the file s_stuff.h on my computer



i don't think this bug is critical enough to make a 0.91.1 release;
however, once there is a 0.91.1 release, there will be a fix for it 
(like there is in current trunk)

-------------- next part --------------
A non-text attachment was scrubbed...
Name: smime.p7s
Type: application/x-pkcs7-signature
Size: 3636 bytes
Desc: S/MIME Cryptographic Signature
URL: <http://lists.puredata.info/pipermail/pd-list/attachments/20090914/22c21d36/attachment.bin>

More information about the Pd-list mailing list